Home > Return Code > Visual Studio Cl Return Code

Visual Studio Cl Return Code

Contents

Proposed as answer by mahmoodn Sunday, December 28, 2008 6:51 PM Sunday, September 21, 2008 12:04 AM 1 Sign in to vote I also got this error code when configuring QT Same for libs - $(WindowsSdkDir)lib;$(VCInstallDir)lib. –foxx1337 Feb 26 '14 at 11:01 add a comment| 2 Answers 2 active oldest votes up vote 8 down vote accepted When trying to compile a c++ windows winapi visual-studio-2012 visual-studio-2013 share|improve this question asked Feb 26 '14 at 10:32 foxx1337 7892713 1 Just as an aid, the exit code can be interpreted as 0xC0000135 (the This documentation is archived and is not being maintained. this content

c:\qcad\src\3rdparty\qt-labs-qtscriptgenerator-4.8.5\generated_cpp\com_trolltech_qt_webkit\qtscriptshell_qwebpluginfactory.cpp(58) : warning C4715: 'QtScriptShell_QWebPluginFactory::create' : not all control paths return a value c:\qcad\src\3rdparty\qt-labs-qtscriptgenerator-4.8.5\generated_cpp\com_trolltech_qt_webkit\qtscriptshell_qwebpluginfactory.cpp(128) : warning C4715: 'QtScriptShell_QWebPluginFactory::plugins' : not all control paths return a value c:\qcad\src\3rdparty\qt-labs-qtscriptgenerator-4.8.5\generated_cpp\com_trolltech_qt_webkit\qtscriptshell_qwebhistoryinterface.cpp(105) : warning C4715: 'QtScriptShell_QWebHistoryInterface::historyContains' How to explain extreme human dimorphism? pch -TP qmake_pch.h NMAKE : fatal error U1077: '"C:\Program Files\Microsoft Visual Studio 10.0\VC\bin\cl.EXE"' : return code '0xc0000135' Stop. If you don't want to use "-c", then you need to write your own Makefile (as like in your application) to compile the agent's *.c and *.h files.

Nmake Fatal Error U1077 Return Code '0x2'

Join them; it only takes a minute: Sign up NMAKE : fatal error U1077: 'cd' :return code '0x2' cl.exe up vote 4 down vote favorite I'm trying to compile QCAD (an Linked 122 How to build Qt for Visual Studio 2010 1 Building LIBSVM on WIndows 8 Building PBRT v2 error - Error 1 error U1077: 'if' : return code '0x1' Related Custom ColorFunction for GeoGraphics plot with ReliefMap Compute the Median 3-prong grounded female plug for 12-gauge wire with an 18-gauge ground wire Hacker used picture upload to get PHP code into

  1. Developer Network Developer Network Developer Sign in Subscriber portal Get tools Downloads Visual Studio SDKs Trial software Free downloads Office resources SharePoint Server 2013 resources SQL Server 2014 Express resources Windows
  2. Running syncqt...
  3. L.E.
  4. How to build the agent with the same compilation parameters that is used in our application code.
  5. It sets the path temporarily for the session - but because the DOS box it generates opens and closes immediately, the changes are lost.
  6. when i run cl from cmd prompt i came to know about this.
  7. All rights reserved.

C:\Program Files\Microsoft SDKs\Windows\v6.0A\Lib\x64   set lib=C:\Program Files\Microsoft SDKs\Windows\v6.0A\Lib\x64;your/other/lib   hope this helps.   Friday, September 12, 2008 12:30 AM 4 Sign in to vote I had the same error when I If you want to use a standard command shell you have to call vcvarsall.bat or similar in the VC directory of you Visual Studio installation. If you run it from within DOS, and do everything you need to do before closing the DOS box, it should work perfectly.Jason Teagle Saturday, March 27, 2010 6:16 PM 0 Nmake : Fatal Error U1077: ‘cd’ : Return Code ‘0x2’ You signed out in another tab or window.

Never ran into this problem on the old development computer with Windows 7 and VS 2012. Nmake Fatal Error U1077 Return Code '0x1' Error Messages During Compilation Error Message Exception: java.io.IOException: CreateProcess: nmake error=2 Compilation Failed. (or) Microsoft (R) 32-bit C/C++ Optimizing Compiler Version 12.00.8168 for 80x86 Copyright (C) Microsoft Corp 1984-1998. type configure -platform win32-msvc2010 and then run nmake share|improve this answer answered Jul 8 '11 at 20:16 Nick 1,0241227 add a comment| Your Answer draft saved draft discarded Sign up You signed in with another tab or window.

Interview for postdoc position via Skype Memorable ordinals What is a non-vulgar synonym for this swear word meaning "an enormous amount"? Nmake Fatal Error U1077 'cd' Return Code '0x1' del qbitarray.obj qbuffer.obj qcryptographichash.obj qfsfileengine.obj qfsfileengine_iterator.obj qbytearray.obj qvsnprin tf.obj qbytearraymatcher.obj qdatetime.obj qdir.obj qdiriterator.obj qfile.obj qtemporaryfile.obj qabstractfileengine.obj qfsfi leengine_win.obj qsystemlibrary.obj qfsfileengine_iterator_win.obj qfileinfo.obj qglobal.obj qhash.obj qiodevice.obj qlist.obj qlinkedlist.obj qlocale.obj qmalloc.obj qmap.obj qregexp.obj qtextcodec.obj share|improve this answer edited Sep 9 '14 at 13:01 answered Sep 4 '14 at 17:46 Kai Schubert 393 add a comment| Your Answer draft saved draft discarded Sign up or You can look up an error code in the winerror.h or ntstatus.h files included in the Windows Software Development Kit in the %ProgramFiles(x86)%\Windows Kits\version\Include\shared\ directory.

Nmake Fatal Error U1077 Return Code '0x1'

asked 2 years ago viewed 11951 times active 8 months ago Linked 1 Fatal error when compiling Qt in Windows Related 7Error when compiling Qt: nmake fatal error U10771error PRJ0002 : If you run it from within DOS, and do everything you need to do before closing the DOS box, it should work perfectly. Nmake Fatal Error U1077 Return Code '0x2' How can I stop Alexa from ordering things if it hears a voice on TV? Nmake Fatal Error U1077 Return Code '0xc0000135' Deleting the CMakeFiles directory solved the problem.

The content you requested has been removed. http://arnoldtechweb.com/return-code/return-code-220.html above to C:\Program Files (x86)\Microsoft Visual Studio 10.0\VC\bin, believing this directory is in PATH, but it was not! Copyright © 2012, ZOHO Corp. Why does the U-2 use a chase car when landing? Nmake Fatal Error U1077 'cl.exe' Return Code '0x1'

Dev centers Windows Office Visual Studio Microsoft Azure More... I'll fiddle with it some more (maybe even install 2010 Express) and then post some more comments as needed and mark the answer. –foxx1337 Feb 26 '14 at 12:29 Thanks in advance. have a peek at these guys Or you've not run the correct vcvarsall.bat? –icabod Feb 26 '14 at 10:40 Thanks for the reply!

One more step Please complete the security check to access ask.wireshark.org Why do I have to complete a CAPTCHA? Nmake Fatal Error U1077 Return Code '0x460' The exit code loudly says "No!" of course. –Hans Passant Feb 26 '14 at 12:09 1 Today I Learned! Error Message If one of the compilation parameter "-c" flag is removed from the Makefile(s), then the compilation errors like missing _start definition, main if missing and other executable definition errors

I created a new environment variable QMAKESPEC and set the value to win-32-msvc2008.

A few rebus puzzles Memorable ordinals Is it possible to set a composite NOT NULL constraint in PostgreSQL Should we eliminate local variables if we can? In a Visual Studio command shell, enter errlook.exe to start the utility; or in the Visual Studio IDE, on the menu bar, choose Tools, Error Lookup. A quick search for that turns up a possibility that you may be linking 32-bit libraries in a 64-bit project? Nmake Fatal Error U1077 'copy' Return Code '0x1' You should use vcvarsall.bat to > configure your path properly. > > http://msdn.microsoft.com/en-us/library/x4d2c09s.aspx Thank you Report post Edit Delete Reply with quote Forum List Topic List New Topic Search Register User

Log in with Google account | Log in with Yahoo account | Log in with Facebook account No account? Microsoft (R) Program Maintenance Utility Version 10.00.30319.01 Copyright (C) Microsoft Corporation. I guess that's it! check my blog Register here.

The content you requested has been removed. Yes No Additional feedback? 1500 characters remaining Submit Skip this Thank you! What is the "crystal ball" in the meteorological station? I am not sure the 7.1 SDK includes them and I don't have a Visual Studio 2010 setup available. –foxx1337 Feb 26 '14 at 12:03 I highly doubt it

Building qmake failed, return code 2 E:\qt_source> What am I doing wrong? Reload to refresh your session. Privacy statement Help us improve MSDN. Completing the CAPTCHA proves you are a human and gives you temporary access to the web property.

Jason Teagle ^ Works. How to say "to master Esperanto"? in command prompt0Lnk 2019, LNK1120 , using nmake; Unable to build Qt and integrate to VS20130NMAKE fatal error U1077 in Qt build with webkit Hot Network Questions What do you call It sets the path temporarily for the session - but because the DOS box it generates opens and closes immediately, the changes are lost.

Not the answer you're looking for? The following error window pops up on my screen 4 times: Is there a specific reason it's looking for 110.dll instead of 120.dll, which I have? Quick note, as I just found this thread when I got the error myself trying to build OpenSSL, the BAT file is called vsvars.bat for me, and I found that I Ask a question Quick access Forums home Browse forums users FAQ Search related threads Remove From My Forums Answered by: NMAKE : fatal error U1077: '"path\cl.exe"' : return code '0xc0000135' Archived

pch -TP qmake_pch.h NMAKE : fatal error U1077: '"C:\Program Files\Microsoft Visual Studio 10.0\VC\bin\cl.EXE"' : return code '0xc0000135' Stop. We appreciate your feedback.