Home > Failed To > Migration Manager Failed To Read Data From Stream

Migration Manager Failed To Read Data From Stream

Contents

For example, Product 1b - Email Account. No. to variable "%2" cannot be applied.0xC001C013-1073627117DTS_E_OBJECTNOTINFOREACHLOOPFailure when adding an object to a ForEachPropertyMapping that is not a direct child of the ForEachLoop container.0xC001F001-1073614847DTS_E_FAILEDSYSTEMVARIABLEREMOVEFailed to remove a system variable. Some of the major libvirt features are: VM management: Various domain lifecycle operations such as start, stop, pause, save, restore, and migrate. this contact form

This means that multiple threads can act on a single virConnect instance without issue. Migrate accounts that meet the following criteria: Created between January 1, 2004 and June 31, 2004 Have an active account status Purchased the Product 1b - Email Account product src_database=0.0.0.1 dest_database=0.0.0.2 It also describes how to perform such account migration when you use Oracle IMDB Cache in your environment. Finding Debugging Information For information on why a batch failed, you can run a job_details report or check any of the following files, which are located in the directories you specified

Failed Waiting For Data. Error 195887167. Connection Closed By Remote Host, Possibly Due To Timeout.

Hydra will delete this file if it detects a successful install. Note: If necessary, run the pin_tt_schema_gen utility against the destination Oracle IMDB Cache grid to generate the required tt_load_Logical_Partition.sql scripts for the logical partitions. Will restarting the libvirt daemon stop my virtual machines? Even if only a single supported hypervisor implements feature FOO, the API and XML changes need to be made sufficiently general in case any other hypervisor eventually supports FOO.

  1. It may have been removed from the package.0xC001F036-1073614794DTS_E_INVALIDPROPERTYMAPPINGThe property mapping is not valid.
  2. Details had been logged for the administrator."This issue does not occur with other file types, such as a PDF or text file.Steps to reproduce: Install Plesk 11.5 on Centos 6 x64,
  3. I recognized this after my first login into webmail, normally the inbox is shown (I configured my webmaoil this way) but after the migration this setting is lost - including all
  4. The error returned is 0x%2!8.8X!.0xC001F026-1073614810DTS_E_FAILEDPROPERTYSET_ERRORINFOAn error occurred while setting the value of property "%1".
  5. After that install it back with the same manner.
  6. AMM installation log file (pin_amt_install.log) AMM Controller log file (controller_N_YYYYMMDDhhmm.log) pin_amt log file (pin_amt.log) AMM configuration file (Infranet.properties) Account search configuration file (account_search.cfg) AMM Mover log files (amt_migrate_JobID_BatchNumber.log) AMM delete log

Lucia St. The contact information for this task is "%1".0xC0010027-1073676249DTS_E_ERRORLOADINGTASKNOCONTACTError loading task "%1".0xC0010028-1073676248DTS_E_ERRORATLOADTASKError loading task. A specific XML parser error will be posted.0xC0011008-1073672184DTS_E_LOADFROMXMLError loading from XML. Vmotion Fails At 21 This occurs when the client calls resume, but the package is not suspended.0xC001B002-1073631230DTS_E_ALREADYEXECUTINGExecute call failed because the executable is already executing.

Table 34-1 account_search.cfg Parameters Parameter Description Required src_database Specifies the source database schema, which is the schema from which you are migrating accounts. Failed Waiting For Data. Error 195887371 See "Configuring the TimesTen JDBC Driver Jar file for BRM". Submit your jobs. This may occur if another instance of this package is currently executing.0xC001604C-1073651636DTS_E_OPENCHECKPOINTFILECheckpoint file "%1" failed to open due to error 0x%2!8.8X! "%3".0xC001604D-1073651635DTS_E_CREATECHECKPOINTFILECheckpoint file "%1" failed during creation due to error 0x%2!8.8X!

Try shortening the VersionComments.0xC0010009-1073676279DTS_E_ELEMENTNOTFOUNDThe element cannot be found in a collection. Failed To Send Buffer To Remote Host: Timeout. while retrieving dependencies. No max_group_size Specifies the maximum size of an account group that AMM can migrate. Checking the AMM Controller Log File The AMM Controller log file contains a detailed list of all transactions executed by the AMM Controller.

Failed Waiting For Data. Error 195887371

The version number is negative.0xC001700D-1073647603DTS_E_PACKAGEUPDATEDISABLEDThe package has an older format version, but automatic package format upgrading is disabled.0xC001700E-1073647602DTS_E_EXPREVALTRUNCATIONASERRORA truncation occurred during evaluation of the expression.0xC0019001-1073639423DTS_E_FAILEDSETEXECVALVARIABLEThe wrapper was unable to set the pop over to these guys Originally, the MSI installed itself on a per-user basis rather than per-machine. Failed Waiting For Data. Error 195887167. Connection Closed By Remote Host, Possibly Due To Timeout. Vertical bars were found on the connection string, meaning multiple file names are being specified and, in addition, the Retain property is TRUE.0xC0014020-1073659872DTS_E_ODBCERRORAn ODBC error %1!d! Migration To Host Failed With Error Already Disconnected HTTP connection manager only supports CERN-type proxies.0xC0016015-1073651691DTS_E_OPENCERTSTOREError opening certificate store.0xC0016016-1073651690DTS_E_UNPROTECTXMLFAILEDFailed to decrypt protected XML node "%1" with error 0x%2!8.8X! "%3".

This means that Hydra is unable to uninstall the previous version prior to installing the 3.x Tentacle.In this case, you will have to log onto your Tentacle machine as the user weblink Whenever you encounter this error, please file a bug. Required variables are variables that are created by the runtime for communicating between tasks and the runtime.0xC001F002-1073614846DTS_E_CHANGESYSTEMVARIABLEREADONLYFAILEDChanging the property of a variable failed because it is a system variable. For example, Xen and VMWare store their own configs, and libvirt just translates this to XML when 'virsh dumpxml' is called.. Failed Waiting For Data. Error 195887107

More info can be found here: http://support.microsoft.com/kb/314088/EN-US/ http://support.microsoft.com/?kbid=309283 Error: domain did not show up For a while, this was a kind of catch all error for qemu/kvm guest start up failures. If your VM is still not listed, determine which URI virsh is defaulting to with: virsh uri If the default URI is not as expected, you can manually specify a URI If the AMM Controller is down or cannot be started, check the AMM Controller log file for more information. http://arnoldtechweb.com/failed-to/failed-to-read-scan-data-iwlist.html AMM can search for accounts that meet five default criteria: Account creation date Account status Billing day of month Product name POID If you would like to migrate accounts that meet

This error happens when a component or task attempts to create a variable with a namespace of "System".0xC001000E-1073676274DTS_E_CONNECTIONNOTFOUNDThe connection "%1" is not found. The Vmotion Failed Because The Destination Host Did Not Receive Data From The Source Host This is an internal error code.0xC0016020-1073651680DTS_E_PACKAGEMIGRATIONFAILEDPackage migration from version %1!d! NO.

See: Setting up a Host Bridge How do I get my VM to use an existing network bridge?

and %2!d!.0xC001602E-1073651666DTS_E_FTPCREATEFOLDERCreating folder "%1" ... %2.0xC001602F-1073651665DTS_E_FTPDELETEFOLDERDeleting folder "%1" ... %2.0xC0016030-1073651664DTS_E_FTPCHANGEFOLDERChanging current directory to "%1". %2.0xC0016031-1073651663DTS_E_FTPFILESEMPTYNo files to transfer. Therefore, if you pause one job and then enable a second job, the AMT Controller cannot begin processing the second job until the first job is finished. Automating Account Migration You can use an external scheduler, such as cron, to automate account migration during your maintenance window. Failed To Get Dvs State In The Pre Copy Phase From The Source Host Mapping a For Each Variable number %1!d!

This could occur because the MSDTC Service is not running.0xC001401B-1073659877DTS_E_SETQUALIFIERDESIGNTIMEONLYThe SetQualifier method cannot be called on a connection manager during package execution. Stay logged in Plesk Forum Home Forum > Older Products Discussion > Older Panel Software Versions > Plesk 9.x for Windows > Plesk 9.x for Windows Issue, Fixes, How-To > Go View 1 Replies View Related Plesk 12.x / Linux :: HTML Email In Horde Jul 24, 2014 I've just upgraded from Plesk 11.something to 12.0.18 on Centos 6. his comment is here The file may be read only.0xC0012023-1073668061DTS_E_FAILPACKAGEONFAILURENAFailPackageOnFailure property is not applicable to the package container.0xC0012024-1073668060DTS_E_TASKPRODUCTLEVELThe task "%1" cannot run on installed %2 of Integration Services.

To pause an account migration job, enter this command: % pin_amt -c pause paused controller controller_id=1 To resume an account migration job, enter this command: % pin_amt -c continue continued controller The contact information for this task is "%3".0xC0010021-1073676255DTS_E_ERRORELEMENTNOTINCOLLElement "%1" does not exist in collection "%2".0xC0010022-1073676254DTS_E_MISSINGOBJECTDATAThe ObjectData element is missing in the XML block of a hosted object. Looks like Python does not contain several files in C:\Program Files\SWsoft\Plesk\Additional\Python\Lib\site-packages.