Home > Failed To > Failed To Load Applicationcontext Contextconfiguration

Failed To Load Applicationcontext Contextconfiguration

Contents

DEBUG: org.springframework.test.context.support.DelegatingSmartContextLoader - Delegating to GenericXmlContextLoader to process context configuration [[emailprotected] declaringClass = 'nl.rivm.vubis2warp.task.impl.SchedulerImplTest', locations = '{classpath:/nl/rivm/vubis2warp/task/impl/test-context.xml}', classes = '{}', inheritLocations = true, contextLoaderClass = 'org.springframework.test.context.ContextLoader']. Thank you very much. –J. Álvarez Mar 29 '16 at 15:45 add a comment| up vote 1 down vote The exception clearly shows java.lang.IllegalStateException: Cannot convert value of type [java.lang.String] to What does Joker “with TM” mean in the Deck of Many Things? java spring maven-2 junit junit4 share|improve this question edited Apr 9 '10 at 12:24 Bozho 395k88795959 asked Apr 9 '10 at 3:05 robinmag 4,442134353 1 Please, please use code blocks Source

Related 1Why do all Spring Roo testRemove() tests fail after creating an ApplicationContext object?3Failed to load Spring ApplicationContext3Exception: Must start with Java agent to use InstrumentationLoadTimeWeaver. Ultimate Australian Canal How to turn on Xbox One from Windows 10 PC using Cortana Why isn't the religion of R'hllor, The Lord of Light, dominant? Memorable ordinals What does Joker “with TM” mean in the Deck of Many Things? Use the [ code ] tags, young padawan #2 Oct 2nd, 2012, 08:58 AM In general if the file cannot be loaded it either isn't there or isn't readable... page

Failed To Load Applicationcontext Junit Spring

What are the benefits of an oral exam? I've broken my new MacBook Pro (with touchbar) like this, do I have to repair it? Are there any rules of thumb for the most comfortable seats on a long distance bus?

Also, judging from the path, you are on a Unix based system is the file readable (I would expect so because you can also copy the file)... So it's important that you add the slash when referencing the file in the root directory of the classpath. Why doesn't my piece of code work? Failed To Load Applicationcontext Error Creating Bean With Name share|improve this answer answered Apr 9 '10 at 12:36 Pascal Thivent 408k838391000 process-test-resources helped.

When does it make sense to duplicate data for querying Equation system with two unknown variables How to interpret this decision tree? Failed To Load Applicationcontext Spring Boot asked 2 years ago viewed 306 times active 2 years ago Related 4Junit class - Failed to load ApplicationContext2Junit 4 Spring - Failed to load ApplicationContext17Failed to load ApplicationContext for JUnit Should we eliminate local variables if we can? more hot questions question feed lang-java about us tour help blog chat data legal privacy policy work here advertising info mobile contact us feedback Technology Life / Arts Culture / Recreation

Do you have in there [project_name]/src/main/resources as a Source folder? –Andrei Stefan Jul 16 '14 at 9:19 I think you can use it without classpath: @ContextConfiguration(locations = { "/spring/applicationContext.xml", Jenkins Failed To Load Applicationcontext Did you configure anything fancy in your pom? I suppose just wrong context declaration as pointed in comment by Prasanna Talakanti. –GKislin Jun 21 '16 at 21:22 add a comment| up vote 8 down vote My test context file asked 2 years ago viewed 60558 times active 8 months ago Get the weekly newsletter!

Failed To Load Applicationcontext Spring Boot

How does changing metrics help to find solutions to a partial differential equation? http://stackoverflow.com/questions/24776669/failed-to-load-applicationcontext-from-unit-test-filenotfound What would be your next deduction in this game of Minesweeper? "How are you spending your time on the computer?" Is it a security vulnerability if the addresses of university students Failed To Load Applicationcontext Junit Spring I would think the classpath for the non-forked surefire differs from the default one. Failed To Load Applicationcontext Junit Spring Maven If it is not there, you'd have to build first.

Thanks, - Dave Mark Spritzler ranger Sheriff Posts: 17278 6 I like... this contact form choose source folder and add path to the spring build path... –Thanh Duy Ngo Sep 7 '15 at 6:48 add a comment| up vote 2 down vote try as below @ContextConfiguration Changing Compile on Save=For test execution only to Compile on Save=Disable fixes the problem. share|improve this answer answered May 21 '10 at 19:30 Jesse Webb 14.5k1470108 add a comment| up vote 1 down vote You seem to be using maven, and trying to run the Failed To Load Applicationcontext Intellij

more hot questions question feed default about us tour help blog chat data legal privacy policy work here advertising info mobile contact us feedback Technology Life / Arts Culture / Recreation Join them; it only takes a minute: Sign up Java Project: Failed to load ApplicationContext up vote 18 down vote favorite 2 I have a Java Project in which I am without a substitution. have a peek here How to copy text from command line to clipboard without using the mouse?

So, I changed the location to test/resources and renamed it to test-dispatcher-servlet.xml and it worked like a charm. Caught Exception While Allowing Testexecutionlistener Failed To Load Applicationcontext Related 11How to get Spring to autowire integration test class using multiple contexts?2Why is junit giving me a failed to load ApplicationContext error4Junit class - Failed to load ApplicationContext1Failed to load Similar Threads [beans.xml] cannot be opened because it does not exist Spring JUnit error Spring TestCase Exception FileNotFoundException for context file Main Exception All times are in JavaRanch time: GMT-6 in

How did Adebisi make his hat hanging on his head?

  1. This should show in Maven's debug output, but no, the different debug outputs even claim to use the same classpaths (screenshot attached).
  2. That way it looks for the object referenced by "fuenteDatosPostgreSQL" rather than the simply the String "fuenteDatosPostgreSQL".
  3. Changing thickness of outline in QGIS No word for "time" until 1871?
  4. Authentication Error for ABBY Ocr Sdk!
  5. share|improve this answer answered May 29 '15 at 22:32 lekant 344211 add a comment| up vote 0 down vote I had the same problem, all files were successfully copied to target/classes
  6. Your Controller should be a pojo, so you don't need a true web environment in your tests.
  7. I also tried the Maven only option: copied working folder outside the reach of Eclipse/STS, then it ran 'mvn clean test' followed by 'mvn test', but test-context.xml isn't found in either

asked 4 years ago viewed 67857 times active 1 year ago Linked 3 Failed to load Spring ApplicationContext 5 How to run tests after deployment using Maven? 0 Spring ContextConfiguration Initializers What does the expression 'seven for seven thirty ' mean? I've broken my new MacBook Pro (with touchbar) like this, do I have to repair it? Failed To Load Applicationcontext Gradle Check the buil folder (target/test-classes/) for applicationContext.xml.

Here is the folder structure. I've included relevant outputs instead (some longer lines removed): forkmode none: Code: [DEBUG] Configuring mojo 'org.apache.maven.plugins:maven-surefire-plugin:2.10:test' with basic configurator --> [DEBUG] (s) basedir = /home/gerjan/Desktop/vubis2warp [DEBUG] (s) childDelegation = false [DEBUG] This is a server side code. Check This Out Place your config file into src/main/resources/app-context.xml and use code @RunWith(SpringJUnit4ClassRunner.class) @ContextConfiguration(locations = "classpath:app-context.xml") public class PersonControllerTest { ... } or you can make yout test context with different configuration of beans.

Is there any term for this when movie doesn't end as its plot suggests Memorable ordinals Why doesn't my piece of code work? asked 6 years ago viewed 44866 times active 1 year ago Linked 18 Location of spring-context.xml Related 12Test-resources of dependecies not in classpath?1Spring jUnit Testing - either can not autowire or Use the [ code ] tags, young padawan #6 Oct 2nd, 2012, 09:55 AM Hmm strange... Anagram puzzle whose solution is guaranteed to make you laugh How to copy text from command line to clipboard without using the mouse?

I have read all the questions related and tried the solutions, but no success. In this case put the applicationContext.xml file in the src/main/resources directory. Browse other questions tagged spring spring-mvc junit junit4 spring-mvc-test or ask your own question. How to bevel only one end of a cylinder?

Why would two species of predator with the same prey cooperate? more hot questions question feed default about us tour help blog chat data legal privacy policy work here advertising info mobile contact us feedback Technology Life / Arts Culture / Recreation Also you can change many thinks in maven. more stack exchange communities company blog Stack Exchange Inbox Reputation and Badges sign up log in tour help Tour Start here for a quick overview of the site Help Center Detailed

The approach you suggested works: clean + build, then run as JUnit test (either project or test class). The complete stack trace is this: java.lang.IllegalStateException: Failed to load ApplicationContext at org.springframework.test.context.CacheAwareContextLoaderDelegate.loadContext(CacheAwareContextLoaderDelegate.java:99) at org.springframework.test.context.DefaultTestContext.getApplicationContext(DefaultTestContext.java:101) at org.springframework.test.context.support.DependencyInjectionTestExecutionListener.injectDependencies(DependencyInjectionTestExecutionListener.java:109) at org.springframework.test.context.support.DependencyInjectionTestExecutionListener.prepareTestInstance(DependencyInjectionTestExecutionListener.java:75) at org.springframework.test.context.TestContextManager.prepareTestInstance(TestContextManager.java:331) at org.springframework.test.context.junit4.SpringJUnit4ClassRunner.createTest(SpringJUnit4ClassRunner.java:213) at org.springframework.test.context.junit4.SpringJUnit4ClassRunner$1.runReflectiveCall(SpringJUnit4ClassRunner.java:290) at org.junit.internal.runners.model.ReflectiveCallable.run(ReflectiveCallable.java:12) at org.springframework.test.context.junit4.SpringJUnit4ClassRunner.methodBlock(SpringJUnit4ClassRunner.java:292) at org.springframework.test.context.junit4.SpringJUnit4ClassRunner.runChild(SpringJUnit4ClassRunner.java:233) Any thoughts? i try to set all version of this plugins but it still doesn't work –herau Jun 13 '14 at 8:23 add a comment| up vote 0 down vote UPDATED: Actually in

From Maven POM Reference: The testResources element block contains testResource elements. DEBUG: org.springframework.test.context.ContextLoaderUtils - Could not find an 'annotation declaring class' for annotation type [interface org.springframework.test.context.ActiveProfiles] and class [class nl.rivm.vubis2warp.task.impl.SchedulerImplTest] DEBUG: org.springframework.test.annotation.ProfileValueUtils - Retrieved @ProfileValueSourceConfiguration [null] for test class [nl.rivm.vubis2warp.task.impl.SchedulerImplTest] DEBUG: org.springframework.test.annotation.ProfileValueUtils This value compiles changed files and replaces resources with new files. I rather use test-app-context.xml for testing and app-context.xml to separate their usage and content.

Having that said, your code looks fine and resources for the test source code should have been copied either by your IDE or by Maven when running tests and should thus I managed to load the context with @ContextConfiguration(locations={"classpath:**/test-context.xml"}) But reference (in test-context.xml) to the application-context.xml which is under src\main\resources\spring folder failed I managed to load the application-context by creating a ClassPathXmlApplicationContext