Home > Exit Code > Altiris Return Code 259

Altiris Return Code 259

Contents

It looks like we may be going to 10g in the near future, so I want to be able to just change one Altiris install job instead of having to figure If joining a domain, go to System in Control Panel to change the computer name and try again. I created this in batch and it worked for my deployment."%~dp0Img\Setup.exe" /qb /I %~dp0Img\Config.ini /language en-us:SetupIsRunningtimeout /t 30 /nobreakfor /f %%x in ('tasklist /fi "imagename eq Setup.exe" /nh') do if %%x The help file you sent does have a sample script that may be able to do this.   Please let me know if you have any other questions. have a peek at this web-site

The vendor supplying the DLL should be contacted for a new DLL. [ERROR_ILLEGAL_DLL_RELOCATION (0x26F)]Error Code 624: {DLL Initialization Failed} The application failed to initialize because the window station is shutting down. As to the specific return codes within the log that is also dependent on application. The join or form operation was aborted. 5078 The specified resource type was not found. 5079 The specified node does not support a resource of this type. Answered 12/22/2008 by: dinozilla Please log in to comment Please log in to comment 0 anyone hit this before? go to this web-site

Program Exit Code 259 Sccm 2012

It seems that AutoDesk is a proud member of the other A-List vendors (Apple, Adobe) that produce problematic products for enterprise deployment. 0 Comments [ + ] Show Comments Comments if after about 5 to 7 minutes, if the service isn't there... The recovery was successful. 1015 The registry is corrupted.

Regards, Tony Tuesday, April 22, 2014 9:58 AM Reply | Quote 0 Sign in to vote I am also getting Error "Program exit code 259" in Execmgr.log while deploying AutoCAD 2014. This may be due to a bad (or changed) name supplied to the resource DLL. 5081 No authentication package could be registered with the RPC server. 5082 You cannot bring the I will keep the rest in mind and hopefully that's a KB for people coming here and search for exit code 259 and point them in the right direction. Program Ran Past Its Maximum Runtime. It Will Be Orphaned Thanks! 6 commentsshareall 6 commentssorted by: besttopnewcontroversialoldrandomq&alive (beta)[–]bofhxx 1 point2 points3 points 11 months ago(1 child)I suspect your installer is spawning another process which actually does the install then quitting, resulting in the 259

Complete that installation before proceeding with this install. Execution Is Complete For Program The Exit Code Is 259 Therefore, the service control manager cannot take action if this service's process terminates unexpectedly. 1082 No recovery program has been configured for this service. 1083 The executable program that this service You could add 259 as a successful code, however you should check out the installer for any options that alter this behaviour. https://www.reddit.com/r/SCCM/comments/41ikrw/sccm_exit_code_259/ Hibernation will be disabled until the system is restarted. [ERROR_HIBERNATION_FAILURE (0x290)]Error Code 665: The requested operation could not be completed due to a file system limitation [ERROR_FILE_SYSTEM_LIMITATION (0x299)]Error Code 668: An

Would you like to answer one of these unanswered questions instead? Windows Exit Code 259 All rights reserved.REDDIT and the ALIEN Logo are registered trademarks of reddit inc.πRendered by PID 5642 on app-188 at 2017-01-08 21:24:18.944804+00:00 running 95f0e88 country code: DE. However the program is exiting within 20 seconds with a code 259. Verify that the temp folder exists and that you can write to it.

  1. You may choose OK to terminate the process [ERROR_DEBUG_ATTACH_FAILED (0x24E)]Error Code 591: {Fatal System Error} The %hs system process terminated unexpectedly with a status of 0x%08x (0x%08x 0x%08x).
  2. Verify that the package exists and that you can access it, or contact the application vendor to verify that this is a valid Windows Installer package. 1620 This installation package could
  3. We have used this snapped version of Oracle9i for years with no problems.
  4. ERROR_INVALID_DATA 87 One of the parameters was invalid.

Execution Is Complete For Program The Exit Code Is 259

i have some error -Error "Program exit code 259", when i try instalation Office 2007 enterprise. https://www.symantec.com/connect/articles/windows-system-error-codes-exit-codes-description Because it has attracted low-quality or spam answers that had to be removed, posting an answer now requires 10 reputation on this site (the association bonus does not count). Program Exit Code 259 Sccm 2012 The exit code is very useful in batch/shell programs which conditionally execute other programs depending on the success or failure of one. Powershell Exit Code 259 It was relatively easy.

Newer Post Older Post Home Subscribe to: Post Comments (Atom) Blog Archive ► 2015 (2) ► February (2) ► 2014 (4) ► June (2) ► May (2) ▼ 2012 (7) ▼ Check This Out The IOCTL_SERIAL_XOFF_COUNTER reached zero.) [ERROR_MORE_WRITES (0x460)]Error Code 1121: A serial I/O operation completed because the timeout period expired. Although, you can attempt to return any integer value as an exit code, only the lowest byte of the integer is returned from your process or thread as part of an The specified service does not exist. 1246 Continue with work in progress. 1247 An attempt was made to perform an initialization operation when initialization has already been completed. 1248 No more Msi Error 259

It can take several minutes before the directories and Oracle Service is installed after setup closes when you run it silently with a rsp file. This may be due to version inconsistencies or due to the absence of the resource DLL on this node. 5080 The specified resource name is supported by this resource DLL. ERROR_INSTALL_ALREADY_RUNNING 1619 This installation package could not be opened. Source And that is why the exit code STILL_ACTIVE (259) sounds so intuitive here. –RBT Feb 14 '16 at 1:38 add a comment| up vote 51 down vote As Sayse mentioned, exit

No more connections can be made to the service at this time because there are already as many connections as the service can accept. 1396 Logon Failure: The target account name Sccm Exit Code Shows that shit is as broken as it has always been :)ReplyDeleteUnknown9 December 2015 at 05:59This comment has been removed by the author.ReplyDeleteJason24 May 2016 at 12:47Impressive script but seems over-engineered. Thanks RJ RJ09 Edited by RJ09 Monday, March 02, 2015 9:38 PM type error Monday, March 02, 2015 9:36 PM Reply | Quote Microsoft is conducting an online survey to understand

Please try to save this file elsewhere. [ERROR_LOST_WRITEBEHIND_DATA_NETWORK_DISCONNECTED (0x314)]Error Code 789: {Delayed Write Failed} Windows was unable to save all the data for the file %hs; the data has been lost.

I saw this a lot with debugging web services, because the thread continues to run after executing each web service call (as it is still listening for further calls). To change the owner node for the group, move the group. 5083 The join operation failed because the cluster database sequence number has changed or is incompatible with the locker node. A zero value indicates success, while a non zero value indicates failure. Msi Exit Code 259 Please contact your system administrator. 1269 The smartcard certificate used for authentication was not trusted.

There are some defaults but you can specify your own in each application. Consult the Windows Installer SDK for detailed command line help. It is only available on Windows 2000 and Windows XP with Window Installer version 2.0. have a peek here Maybe there's a window invisible to the end user waiting for input or something like that.

Check and see if that might be your problem. Contact your support personnel. 1632 The Temp folder is on a drive that is full or inaccessible. Normally I wouldn't recommend re-packaging something like this when there is a response file available, but if you are having trouble you could use Wise and capture the install/reboots/updates. It is corrupt [ERROR_CANNOT_LOAD_REGISTRY_FILE (0x24D)]Error Code 590: {Unexpected Failure in DebugActiveProcess} An unexpected failure occurred while processing a DebugActiveProcess API request.

ERROR_PATCH_PACKAGE_INVALID 1637 This patch package cannot be processed by the Windows Installer service. CheckProcess = False Else 'process is not running. The recovery was successful. [ERROR_REGISTRY_RECOVERED (0x3F6)]Error Code 1015: The registry is corrupted. Either search for the error message itself or just the error code, like "Error Code 635".Error Code 1: Incorrect function. [ERROR_INVALID_FUNCTION (0x1)]Error Code 2: The system cannot find the file specified.

Wednesday, 30 May 2012 SCCM: Package returning error 259 how-to resolve After attempting to deploy namely "AutoDesk" to an environment, we came across an issue where the SCCM Advertisement was returning To configure or remove the existing version of this product, use Add/Remove Programs on the Control Panel. What would be your next deduction in this game of Minesweeper? Then I'll try with the silent switch, then add some wait time so the install has a chance to finish before telling the DS to continue with more jobs.

This error should never be returned to an application [ERROR_NET_OPEN_FAILED (0x23A)]Error Code 571: {Privilege Failed} The I/O permissions for the process could not be changed. [ERROR_IO_PRIVILEGE_FAILED (0x23B)]Error Code 572: {Application Exit Go to System in the Control Panel to change the computer name and try again. 53 The network path was not found. 54 The network is busy. 55 The specified network Verify that the program to be upgraded exists on your computer and that you have the correct upgrade patch. 1643 The patch package is not permitted by software restriction policy. 1644 I have deployed 3 versions of the suite this way both as a package and application and it works perfectly.

There is some difference in the systems where it is failing. Code Description 0 The operation completed successfully. 1 Incorrect function. 2 The system cannot find the file specified. 3 The system cannot find the path specified. 4 The system cannot open jenifer.arnold, Jul 13, 2007 #6 carymon New Member Hi Jenifer, Does it have it's own installer? Please contact your system administrator.